{"text_format":"1","workbook":"xlsx","n_sheets":6,"sheets":["PROBABILIDAD","GRAVEDAD","RIESGO","B","Hoja2","M"],"not_rendered":{"charts":0,"images":10,"macros":1,"external_links":0,"defined_names":3,"comments":0,"pivot_tables":0},"unopened":[],"bounds":{"document_bytes":16777216,"sheet_cells":100000,"rows_first":2000,"rows_last":500,"rows_between":2000,"halvings":0,"cell_chars":16384,"cell_head_chars":4096},"cells_cut":0,"cells_raw":0,"read":"whole","date_system":"1900"}

{"sheet":"PROBABILIDAD","index":0,"n_rows":6,"n_cols":3,"rows_kept":6,"cut":false,"hidden":true,"merged":[]}
["PROBABILIDAD","DESCRIPCIÓN","VALOR"]
["< una vez a la semana","Muy probable",5]
["> una vez a la semana y < una vez al mes","Altamente probable",4]
["> una vez al mes y < una vez al año","Probable",3]
["> una vez al año y < una vez cada 5 años","Posible",2]
[">una vez cada 5 años","Poco probable",1]

{"sheet":"GRAVEDAD","index":1,"n_rows":32,"n_cols":11,"rows_kept":32,"cut":false,"hidden":true,"merged":[]}
["VALOR","VALORACIÓN (lo)","VALORACIÓN (lo)","VALOR ASIGNADO",null,null,null,"Seleccione posible entorno de afectación"]
["No relevante",5,7,1,null,null,null,"Entorno Natural"]
["Leve",8,10,2,null,null,null,"Entorno Humano"]
["Moderado",11,14,3]
["Grave",15,17,4]
["Crítico",18,20,5]
[]
[]
["Humano","Ecológico","Socioeconómico","Descripción","Valor",null,null,"Pob. Afectada","Valor","Valor","Patrimonio y capital productivo"]
["Más de 100","Daños muy altos: Explotación indiscriminada de RRNN y existe un nivel de contaminación muy alto","Letal: Pérdida del 100% del cuerpo receptor. Se aplica en los casos en que se prevé la pérdida total del receptor y nula distribución de recursos","Muy alto",4,null,null,"Muy alto",4,4,"Muy alto"]
["Entre 50 y 100","Daños altos: Alto nivel de explotación de RRNN y existe un nivel de contaminación moderado","Agudo: Pérdida del 50% del receptor. Cuando el resultado prevé efectos agudos y en los casos de una pérdida parcial pero intensa del receptor. Escasamente productiva","Alto",3,null,null,"Alto",3,3,"Alto"]
["Entre 5 y 50","Daños moderados: Moderado nivel de explotación de RRNN y existe un nivel de contaminación leve","Crónico: Pérdida de entre el 10 y 20% del receptor. Los efectos a largo plazo implican pérdida de funciones que puede hacerse equivalente a ese rango de pérdida del receptor, también se aplica en los casos de escasas pérdidas directas del receptor. Medianamente productiva","Bajo",2,null,null,"Bajo",2,2,"Bajo"]
["Menos de 5","Daños leves: Conservación de RRNN y no existe nivel de contaminación","Pérdida de entre 1 y 2% del receptor. Esta se puede clasificar los escenarios que producen efectos pero dificilmente medido o evaluados, sobre el receptor. Alta productividad","Muy bajo",1,null,null,"Muy bajo",1,1,"Muy bajo"]
[]
[]
["Cantidad","Categoría","Valor"]
["Mayor a 500","Muy Alta",4]
["50-500","Alto",3]
["5-49","Muy Poca",2]
["Menor a 5","Poca",1]
[]
["Peligrosidad","Categoría","Valor"]
["-Muy Inflamable\n-Muy tóxica\n-Causa efectos irreversibles inmediatos","Muy peligroso",4]
["-Explosiva\n-Inflamable\n-Corrosivo","Peligroso",3]
["-Combustible","Poco peligroso",2]
["-Daños leves y reversibles","No peligroso",1]
[]
["Extensión","Categoría","Valor"]
["Radio mayor a 1km","Muy extenso",4]
["Radio hasta 1km","Extenso",3]
["Radio menos a 0.5km (zona emplazada)","Poco extenso",2]
["Área afectada (zona delimitada)","Puntual",1]

{"sheet":"RIESGO","index":2,"n_rows":2,"n_cols":6,"rows_kept":2,"cut":false,"hidden":false,"merged":[[1,5,2,18]]}
[]
[null,null,null,null,null,"FORMULARIO  PARA LA ESTIMACIÓN DEL NIVEL DE RIESGO\nQUE GENERA EL INCUMPLIMIENTO DE LAS OBLIGACIONES\nFI SCALIZABLES"]

{"sheet":"B","index":3,"n_rows":48,"n_cols":7,"rows_kept":48,"cut":false,"hidden":true,"merged":[[29,3,29,6],[8,3,8,6],[10,3,10,6],[1,3,2,7],[18,3,18,5],[19,3,19,5],[24,3,24,6],[23,3,23,6],[28,3,28,6],[46,2,46,6],[47,2,47,6],[33,3,33,6],[34,3,34,6],[40,2,40,6],[41,2,41,6],[43,2,43,6],[44,2,44,6]]}
[]
[null,null,null,"FORMULARIO PARA CÁLCULO DE RIESGO"]
[]
[]
[]
[null,null,"ESTIMACIÓN DE PROBABILIDAD"]
[]
[null,null,"Seleccionar la descripción:"]
[null,null,"Descripción","< una vez a la semana"]
[]
[null,null,"Categoría",{"$f":"VLOOKUP($D$9,PROBABILIDAD!$A$1:$C$6,2,FALSE)","v":"Muy probable"}]
[]
[]
[]
[null,null,"CÁLCULO DE LA GRAVEDAD"]
[]
[null,null,"Seleccionar el entorno:"]
[]
[null,null,"Entorno","Descripción",null,null,"Categoría"]
[null,null,"Socioeconómico","Crónico: Pérdida de entre el 10 y 20% del receptor. Los efectos a largo plazo implican pérdida de funciones que puede hacerse equivalente a ese rango de pérdida del receptor, también se aplica en los casos de escasas pérdidas directas del receptor. Medianamente productiva",null,null,{"$f":"IF(OR(D20=GRAVEDAD!$C$10,D20=GRAVEDAD!$B$10,D20=GRAVEDAD!$A$10),GRAVEDAD!$D$10,IF(OR(D20=GRAVEDAD!$C$11,D20=GRAVEDAD!$B$11,D20=GRAVEDAD!$A$11),GRAVEDAD!$D$11,IF(OR(D20=GRAVEDAD!$C$12,D20=GRAVEDAD!$B$12,D20=GRAVEDAD!$A$12),GRAVEDAD!$D$12,GRAVEDAD!$D$13)))","v":"Bajo"}]
[]
[null,null,"Seleccionar cantidad:"]
[]
[null,null,"TM","Descripición"]
[null,null,"5-49",{"$f":"VLOOKUP($C$25,GRAVEDAD!$A$16:$C$20,2,FALSE)","v":"Muy Poca"}]
[]
[null,null,"Seleccionar peligrosidad:"]
[]
[null,null,"Característica","Descripción"]
[null,null,"-Explosiva\n-Inflamable\n-Corrosivo",{"$f":"VLOOKUP($C$30,GRAVEDAD!$A$22:$C$26,2,FALSE)","v":"Peligroso"}]
[]
[null,null,"Seleccionar extensión:"]
[]
[null,null,"Km","DESCRIPCIÓN"]
[null,null,"Área afectada (zona delimitada)",{"$f":"VLOOKUP($C$35,GRAVEDAD!$A$28:$C$32,2,FALSE)","v":"Puntual"}]
[]
[]
[]
[null,null,"CÁLCULO DEL RIESGO"]
[]
[null,null,"Probabilidad"]
[null,null,{"$f":"VLOOKUP($D$9,PROBABILIDAD!$A$1:$C$6,3,FALSE)","v":5}]
[]
[null,null,"Gravedad"]
[null,null,{"$f":"LOOKUP(VLOOKUP($C$25,GRAVEDAD!$A$16:$C$20,3)+2*VLOOKUP($C$30,GRAVEDAD!$A$22:$C$26,3,FALSE)+VLOOKUP($C$35,GRAVEDAD!$A$28:$C$32,3,FALSE)+VLOOKUP(G20,GRAVEDAD!$D$10:$E$13,2),GRAVEDAD!$B$2:$C$6,GRAVEDAD!$D$2:$D$6)","v":3}]
[]
[null,null,"Riesgo"]
[null,null,{"$f":"C45*C42","v":15}]

{"sheet":"Hoja2","index":4,"n_rows":0,"n_cols":0,"rows_kept":0,"cut":false,"hidden":true,"merged":[]}

{"sheet":"M","index":5,"n_rows":1,"n_cols":2,"rows_kept":1,"cut":false,"hidden":true,"merged":[[0,1,0,16]]}
[null,"FÓRMULA PARA CALIFICAR EL RIESGO AMBIENTAL"]